Reaction Details
TargetKappa-type opioid receptor
LigandBDBM50274402
Substrate/Competitorn/a
Meas. Tech.ChEMBL_537686 (CHEMBL993480)
IC50 55±n/a nM
Citation Kawai, KHayakawa, JMiyamoto, TImamura, YYamane, SWakita, HFujii, HKawamura, KMatsuura, HIzumimoto, NKobayashi, REndo, TNagase, H Design, synthesis, and structure-activity relationship of novel opioid kappa-agonists. Bioorg Med Chem16:9188-201 (2008) 
 
Kappa-type opioid receptor
Name:Kappa-type opioid receptor
Type:Enzyme
Mol. Mass.:42656.78
Organism:Mus musculus (Mouse)
Description:P33534
Residue:380
BDBM50274402
NameBDBM50274402
Synonyms:(2E)-N-[(5R,6R)-4,5-Epoxy-3,14-dihydroxy-17-methylmorphinan-6-yl]-3-(furan-3-yl)-N-methylprop-2-enamide | CHEMBL485554
TypeSmall organic molecule
Emp. Form.C25H28N2O5
Mol. Mass.436.5002
SMILESCN([C@@H]1CC[C@@]2(O)[C@H]3Cc4ccc(O)c5O[C@@H]1[C@]2(CCN3C)c45)C(=O)\C=C\c1ccoc1