Reaction Details
TargetKappa-type opioid receptor
LigandBDBM50274721
Substrate/Competitorn/a
Meas. Tech.ChEMBL_537686 (CHEMBL993480)
IC50 16±n/a nM
Citation Kawai, KHayakawa, JMiyamoto, TImamura, YYamane, SWakita, HFujii, HKawamura, KMatsuura, HIzumimoto, NKobayashi, REndo, TNagase, H Design, synthesis, and structure-activity relationship of novel opioid kappa-agonists. Bioorg Med Chem16:9188-201 (2008) 
 
Kappa-type opioid receptor
Name:Kappa-type opioid receptor
Type:Enzyme
Mol. Mass.:42656.78
Organism:Mus musculus (Mouse)
Description:P33534
Residue:380
BDBM50274721
NameBDBM50274721
Synonyms:(5R,6R)-17-(cyclopropylmethyl)-4,5-epoxy-6-hexyloxy-3,14-dihydroxymorphina | CHEMBL458971
TypeSmall organic molecule
Emp. Form.C26H37NO4
Mol. Mass.427.5763
SMILESCCCCCCO[C@@H]1CC[C@@]2(O)[C@H]3Cc4ccc(O)c5O[C@@H]1[C@]2(CCN3CC1CC1)c45