Reaction Details
TargetSodium-dependent serotonin transporter
LigandBDBM50274185
Substrate/Competitorn/a
Meas. Tech.ChEMBL_536731 (CHEMBL984525)
Ki 3.74±n/a nM
Citation Hatzenbuhler, NTBaudy, REvrard, DAFailli, AHarrison, BLLenicek, SMewshaw, RESaab, AShah, USze, JZhang, MZhou, DChlenov, MKagan, MGolembieski, JHornby, GLai, MSmith, DLSullivan, KMSchechter, LEAndree, TH Advances toward new antidepressants with dual serotonin transporter and 5-HT1A receptor affinity within a class of 3-aminochroman derivatives. Part 2. J Med Chem51:6980-7004 (2008) 
 
Sodium-dependent serotonin transporter
Name:Sodium-dependent serotonin transporter
Type:Multi-pass membrane protein
Mol. Mass.:70168.43
Organism:Rattus norvegicus (rat)
Description:P31652
Residue:630
BDBM50274185
NameBDBM50274185
Synonyms:(-)-8-Chloro-3-{cyclobutyl[3-(5-fluoro-1H-indol-3-yl)propyl]-amino}chromane-5-carboxamide CHEMBL484572
TypeSmall organic molecule
Emp. Form.C25H27ClFN3O2
Mol. Mass.455.952
SMILESNC(=O)c1ccc(Cl)c2OCC(Cc12)N(CCCc1c[nH]c2ccc(F)cc12)C1CCC1