Reaction Details
Target5-hydroxytryptamine receptor 1A
LigandBDBM50274413
Substrate/Competitorn/a
Meas. Tech.ChEMBL_536733 (CHEMBL984527)
Ki 1.98±n/a nM
Citation Hatzenbuhler, NTBaudy, REvrard, DAFailli, AHarrison, BLLenicek, SMewshaw, RESaab, AShah, USze, JZhang, MZhou, DChlenov, MKagan, MGolembieski, JHornby, GLai, MSmith, DLSullivan, KMSchechter, LEAndree, TH Advances toward new antidepressants with dual serotonin transporter and 5-HT1A receptor affinity within a class of 3-aminochroman derivatives. Part 2. J Med Chem51:6980-7004 (2008) 
 
5-hydroxytryptamine receptor 1A
Name:5-hydroxytryptamine receptor 1A
Type:n/a
Mol. Mass.:46122.49
Organism:Homo sapiens (Human)
Description:n/a
Residue:422
BDBM50274413
NameBDBM50274413
Synonyms:(+)-3-[[3-(5-Cyano-1H-indol-3-yl)propyl](cyclobutyl)amino]-8-fluorochromane-5-carboxamide CHEMBL485228
TypeSmall organic molecule
Emp. Form.C26H27FN4O2
Mol. Mass.446.5166
SMILESNC(=O)c1ccc(F)c2OCC(Cc12)N(CCCc1c[nH]c2ccc(cc12)C#N)C1CCC1