Reaction Details
Target4-hydroxy-tetrahydrodipicolinate synthase
LigandBDBM50273974
Substrate/Competitorn/a
Meas. Tech.ChEMBL_536820 (CHEMBL988084)
Ki 220000±n/a nM
Citation Boughton, BAGriffin, MDO'Donnell, PADobson, RCPerugini, MAGerrard, JAHutton, CA Irreversible inhibition of dihydrodipicolinate synthase by 4-oxo-heptenedioic acid analogues. Bioorg Med Chem16:9975-83 (2008) 
 
4-hydroxy-tetrahydrodipicolinate synthase
Name:4-hydroxy-tetrahydrodipicolinate synthase
Type:PROTEIN
Mol. Mass.:31269.12
Organism:Escherichia coli (strain K12)
Description:ChEMBL_536816
Residue:292
BDBM50273974
NameBDBM50273974
Synonyms:3-fluoro-2-oxopropanoate
TypeSmall organic molecule
Emp. Form.C3H2FO3
Mol. Mass.105.0451
SMILES[O-]C(=O)C(=O)CF