Reaction Details
Target4-hydroxy-tetrahydrodipicolinate synthase
LigandBDBM50412479
Substrate/Competitorn/a
Meas. Tech.ChEMBL_536816 (CHEMBL988080)
Ki 4950000±n/a nM
Citation Boughton, BAGriffin, MDO'Donnell, PADobson, RCPerugini, MAGerrard, JAHutton, CA Irreversible inhibition of dihydrodipicolinate synthase by 4-oxo-heptenedioic acid analogues. Bioorg Med Chem16:9975-83 (2008) 
 
4-hydroxy-tetrahydrodipicolinate synthase
Name:4-hydroxy-tetrahydrodipicolinate synthase
Type:PROTEIN
Mol. Mass.:31269.12
Organism:Escherichia coli (strain K12)
Description:ChEMBL_536816
Residue:292
BDBM50412479
NameBDBM50412479
Synonyms:CHEMBL456197
TypeSmall organic molecule
Emp. Form.C11H14O5
Mol. Mass.226.2259
SMILESCCOC(=O)\C=C\C(=O)\C=C\C(=O)OCC