Reaction Details
TargetProstaglandin E synthase
LigandBDBM24561
Substrate/Competitorn/a
Meas. Tech.ChEMBL_560973 (CHEMBL1014420)
IC50 5600±n/a nM
Citation Koeberle, AZettl, HGreiner, CWurglics, MSchubert-Zsilavecz, MWerz, O Pirinixic acid derivatives as novel dual inhibitors of microsomal prostaglandin E2 synthase-1 and 5-lipoxygenase. J Med Chem51:8068-76 (2008) 
 
Prostaglandin E synthase
Name:Prostaglandin E synthase
Type:Protein
Mol. Mass.:17112.22
Organism:Homo sapiens (Human)
Description:n/a
Residue:152
BDBM24561
NameBDBM24561
Synonyms:CHEMBL459722 ethyl 2-{[4-chloro-6-(quinolin-6-ylamino)pyrimidin-2-yl]sulfanyl}octanoate
TypeSmall organic molecule
Emp. Form.C23H27ClN4O2S
Mol. Mass.459.004
SMILESCCCCCCC(Sc1nc(Cl)cc(Nc2ccc3ncccc3c2)n1)C(=O)OCC