Reaction Details
TargetProstaglandin G/H synthase 1
LigandBDBM50273389
Substrate/Competitorn/a
Meas. Tech.ChEMBL_560977 (CHEMBL1014424)
IC50>10±n/a nM
Citation Koeberle, AZettl, HGreiner, CWurglics, MSchubert-Zsilavecz, MWerz, O Pirinixic acid derivatives as novel dual inhibitors of microsomal prostaglandin E2 synthase-1 and 5-lipoxygenase. J Med Chem51:8068-76 (2008) 
 
Prostaglandin G/H synthase 1
Name:Prostaglandin G/H synthase 1
Type:Protein
Mol. Mass.:68868.60
Organism:Ovis aries (Sheep)
Description:n/a
Residue:600
BDBM50273389
NameBDBM50273389
Synonyms:2-(4-Chloro-6-(4'-cyanobiphenyl-4-ylamino)pyrimidin-2-ylthio)octanoic acid | CHEMBL456792
TypeSmall organic molecule
Emp. Form.C25H25ClN4O2S
Mol. Mass.481.01
SMILESCCCCCCC(Sc1nc(Cl)cc(Nc2ccc(cc2)-c2ccc(cc2)C#N)n1)C(O)=O