Reaction Details
TargetProstaglandin G/H synthase 2
LigandBDBM50273707
Substrate/Competitorn/a
Meas. Tech.ChEMBL_561220 (CHEMBL1012766)
IC50>10±n/a nM
Citation Koeberle, AZettl, HGreiner, CWurglics, MSchubert-Zsilavecz, MWerz, O Pirinixic acid derivatives as novel dual inhibitors of microsomal prostaglandin E2 synthase-1 and 5-lipoxygenase. J Med Chem51:8068-76 (2008) 
 
Prostaglandin G/H synthase 2
Name:Prostaglandin G/H synthase 2
Type:Enzyme
Mol. Mass.:69003.89
Organism:Homo sapiens (Human)
Description:Recombinant Cox-2 provided by Cayman (Cayman Chemical Co.,Ann Arbor, MI).
Residue:604
BDBM50273707
NameBDBM50273707
Synonyms:2-(4-Chloro-6-(2-phenoxyethylamino)pyrimidin-2-ylthio)octanoic acid | CHEMBL460396
TypeSmall organic molecule
Emp. Form.C20H26ClN3O3S
Mol. Mass.423.957
SMILESCCCCCCC(Sc1nc(Cl)cc(NCCOc2ccccc2)n1)C(O)=O