Reaction Details
TargetSodium-dependent serotonin transporter
LigandBDBM50124566
Substrate/Competitorn/a
Meas. Tech.ChEMBL_558180 (CHEMBL962314)
IC50 242±n/a nM
Citation Zhang, PTerefenko, EAMcComas, CCMahaney, PEVu, ATrybulski, EKoury, EJohnston, GBray, JDeecher, D Synthesis and activity of novel 1- or 3-(3-amino-1-phenyl propyl)-1,3-dihydro-2H-benzimidazol-2-ones as selective norepinephrine reuptake inhibitors. Bioorg Med Chem Lett18:6067-70 (2008) 
 
Sodium-dependent serotonin transporter
Name:Sodium-dependent serotonin transporter
Type:Multi-pass membrane protein
Mol. Mass.:70322.51
Organism:Homo sapiens (Human)
Description:P31645
Residue:630
BDBM50124566
NameBDBM50124566
Synonyms:(R)-2-((R)-(2-ethoxyphenoxy)(phenyl)methyl)morpholine 2-((2-ethoxyphenoxy)(phenyl)methyl)morpholine 2-[2-ethoxyphenoxy(phenyl)methyl]-1,4-oxazinane REBOXETINE | rac-syn-2-((2-ethoxyphenoxy)(phenyl)methyl)morpholine
TypeSmall organic molecule
Emp. Form.C19H23NO3
Mol. Mass.313.3908
SMILESCCOc1ccccc1OC(C1CNCCO1)c1ccccc1