Reaction Details
TargetMetabotropic glutamate receptor 1
LigandBDBM17657
Substrate/Competitorn/a
Meas. Tech.ChEMBL_559518 (CHEMBL1018991)
Ki 570±n/a nM
Citation Filosa, RCarmela Fulco, MMarinozzi, MGiacchè, NMacchiarulo, APeduto, AMassa, Ade Caprariis, PThomsen, CChristoffersen, CTPellicciari, R Design, synthesis and biological evaluation of novel bicyclo[1.1.1]pentane-based omega-acidic amino acids as glutamate receptors ligands. Bioorg Med Chem17:242-50 (2008) 
 
Metabotropic glutamate receptor 1
Name:Metabotropic glutamate receptor 1
Type:Enzyme
Mol. Mass.:132358.19
Organism:Homo sapiens (Human)
Description:Q13255
Residue:1194
BDBM17657
NameBDBM17657
Synonyms:(2S)-2-aminopentanedioic acid D-Glutamate L-Glu L-Glutamic acid L-gluatmate
TypeAmino Acid
Emp. Form.C5H9NO4
Mol. Mass.147.1293
SMILESN[C@@H](CCC(O)=O)C(O)=O