Reaction Details
TargetSodium-dependent serotonin transporter
LigandBDBM50160248
Substrate/Competitorn/a
Meas. Tech.ChEMBL_560275 (CHEMBL1020453)
Ki 14.8±n/a nM
Citation Zeng, FMun, JJarkas, NStehouwer, JSVoll, RJTamagnan, GDHowell, LVotaw, JRKilts, CDNemeroff, CBGoodman, MM Synthesis, radiosynthesis, and biological evaluation of carbon-11 and fluorine-18 labeled reboxetine analogues: potential positron emission tomography radioligands for in vivo imaging of the norepinephrine transporter. J Med Chem52:62-73 (2009) 
 
Sodium-dependent serotonin transporter
Name:Sodium-dependent serotonin transporter
Type:Multi-pass membrane protein
Mol. Mass.:70322.51
Organism:Homo sapiens (Human)
Description:P31645
Residue:630
BDBM50160248
NameBDBM50160248
Synonyms:(2S,3S)-2-[alpha-(2-Methylphenylthio)phenylmethyl]morpholine CHEMBL179249
TypeSmall organic molecule
Emp. Form.C18H21NOS
Mol. Mass.299.43
SMILESCc1ccccc1S[C@H]([C@@H]1CNCCO1)c1ccccc1