Reaction Details
TargetSodium-dependent noradrenaline transporter
LigandBDBM50254209
Substrate/Competitorn/a
Meas. Tech.ChEMBL_560274 (CHEMBL1020452)
Ki 1.02±n/a nM
Citation Zeng, FMun, JJarkas, NStehouwer, JSVoll, RJTamagnan, GDHowell, LVotaw, JRKilts, CDNemeroff, CBGoodman, MM Synthesis, radiosynthesis, and biological evaluation of carbon-11 and fluorine-18 labeled reboxetine analogues: potential positron emission tomography radioligands for in vivo imaging of the norepinephrine transporter. J Med Chem52:62-73 (2009) 
 
Sodium-dependent noradrenaline transporter
Name:Sodium-dependent noradrenaline transporter
Type:Multi-pass membrane protein
Mol. Mass.:69337.72
Organism:Homo sapiens (Human)
Description:P23975
Residue:617
BDBM50254209
NameBDBM50254209
Synonyms:(2S,3S)-2-[alpha-(2-Methylphenoxy)phenylmethyl]morpholine | CHEMBL467432
TypeSmall organic molecule
Emp. Form.C18H21NO2
Mol. Mass.283.3648
SMILESCc1ccccc1O[C@H]([C@@H]1CNCCO1)c1ccccc1