Reaction Details
TargetDisintegrin and metalloproteinase domain-containing protein 17
LigandBDBM23498
Substrate/Competitorn/a
Meas. Tech.ChEMBL_495052 (CHEMBL1003624)
IC50 8.4±n/a nM
Citation DasGupta, SMurumkar, PRGiridhar, RYadav, MR Current perspective of TACE inhibitors: a review. Bioorg Med Chem17:444-59 (2009) 
 
Disintegrin and metalloproteinase domain-containing protein 17
Name:Disintegrin and metalloproteinase domain-containing protein 17
Type:Enzyme
Mol. Mass.:93007.89
Organism:Homo sapiens (Human)
Description:
Residue:824
BDBM23498
NameBDBM23498
Synonyms:(3S)-4-{[4-(but-2-yn-1-yloxy)benzene]sulfonyl}-N-hydroxy-2,2-dimethylthiomorpholine-3-carboxamide TMI-1
TypeSmall organic molecule
Emp. Form.C17H22N2O5S2
Mol. Mass.398.497
SMILESCC#CCOc1ccc(cc1)S(=O)(=O)N1CCSC(C)(C)[C@@H]1C(=O)NO