Reaction Details
Target72 kDa type IV collagenase
LigandBDBM23498
Substrate/Competitorn/a
Meas. Tech.ChEMBL_495049 (CHEMBL1003621)
IC50 4.7±n/a nM
Citation DasGupta, SMurumkar, PRGiridhar, RYadav, MR Current perspective of TACE inhibitors: a review. Bioorg Med Chem17:444-59 (2009) 
 
72 kDa type IV collagenase
Name:72 kDa type IV collagenase
Type:Enzyme
Mol. Mass.:73870.36
Organism:Homo sapiens (Human)
Description: P08253
Residue:660
BDBM23498
NameBDBM23498
Synonyms:(3S)-4-{[4-(but-2-yn-1-yloxy)benzene]sulfonyl}-N-hydroxy-2,2-dimethylthiomorpholine-3-carboxamide TMI-1
TypeSmall organic molecule
Emp. Form.C17H22N2O5S2
Mol. Mass.398.497
SMILESCC#CCOc1ccc(cc1)S(=O)(=O)N1CCSC(C)(C)[C@@H]1C(=O)NO