Reaction Details
TargetTransient receptor potential cation channel subfamily V member 1
LigandBDBM50247742
Substrate/Competitorn/a
Meas. Tech.ChEMBL_493861 (CHEMBL943269)
EC50 2.45±n/a nM
Citation Choi, HKChoi, SLee, YKang, DWRyu, HMaeng, HJChung, SJPavlyukovets, VAPearce, LVToth, ATran, RWang, YMorgan, MABlumberg, PMLee, J Non-vanillyl resiniferatoxin analogues as potent and metabolically stable transient receptor potential vanilloid 1 agonists. Bioorg Med Chem17:690-8 (2009) 
 
Transient receptor potential cation channel subfamily V member 1
Name:Transient receptor potential cation channel subfamily V member 1
Type:Transient Receptor
Mol. Mass.:94956.12
Organism:Rattus norvegicus (rat)
Description:O35433
Residue:838
BDBM50247742
NameBDBM50247742
Synonyms:CHEMBL509154 | [(1R,2R,6R,10S,11R,15S,17R)-13-benzyl-6-hydroxy-4,17-dimethyl-5-oxo-15-(prop-1-en-2-yl)-12,14,18-trioxapentacyclo[11.4.1.0^{1,10}.0^{2,6}.0^{11,15}]octadeca-3,8-dien-8-yl]methyl 2-(3-fluoro-4-methanesulfonamidophenyl)acetate
TypeSmall organic molecule
Emp. Form.C37H40FNO9S
Mol. Mass.693.778
SMILESC[C@@H]1C[C@]2(OC3(Cc4ccccc4)O[C@@H]2[C@@H]2C=C(COC(=O)Cc4ccc(NS(C)(=O)=O)c(F)c4)C[C@@]4(O)[C@@H](C=C(C)C4=O)[C@@]12O3)C(C)=C