Reaction Details
TargetPeroxisome proliferator-activated receptor alpha
LigandBDBM50256106
Substrate/Competitorn/a
Meas. Tech.ChEMBL_519278 (CHEMBL947730)
EC50 0.0038±n/a nM
Citation Pingali, HJain, MShah, SPatil, PMakadia, PZaware, PSairam, KVJamili, JGoel, APatel, MPatel, P Modulation of PPAR receptor subtype selectivity of the ligands: aliphatic chain vs aromatic ring as a spacer between pharmacophore and the lipophilic moiety. Bioorg Med Chem Lett18:6471-5 (2008) 
 
Peroxisome proliferator-activated receptor alpha
Name:Peroxisome proliferator-activated receptor alpha
Type:Enzyme
Mol. Mass.:52222.08
Organism:Homo sapiens (Human)
Description:Q07869
Residue:468
BDBM50256106
NameBDBM50256106
Synonyms:4-(4-(5-methyl-2-p-tolyloxazol-4-yl)butoxyimino)-4-phenylbutanoic acid | CHEMBL481549
TypeSmall organic molecule
Emp. Form.C25H28N2O4
Mol. Mass.420.5008
SMILESCc1oc(nc1CCCCO\N=C(/CCC(O)=O)c1ccccc1)-c1ccc(C)cc1