Reaction Details
TargetCarbonic anhydrase 1
LigandBDBM50256509
Substrate/Competitorn/a
Meas. Tech.ChEMBL_519583 (CHEMBL943658)
Ki 7420±n/a nM
Citation Smaine, FZPacchiano, FRami, MBarragan-Montero, VVullo, DScozzafava, AWinum, JYSupuran, CT Carbonic anhydrase inhibitors: 2-substituted-1,3,4-thiadiazole-5-sulfamides act as powerful and selective inhibitors of the mitochondrial isozymes VA and VB over the cytosolic and membrane-associated carbonic anhydrases I, II and IV. Bioorg Med Chem Lett18:6332-5 (2008) 
 
Carbonic anhydrase 1
Name:Carbonic anhydrase 1
Type:Enzyme
Mol. Mass.:28873.37
Organism:Homo sapiens (Human)
Description:P00915
Residue:261
BDBM50256509
NameBDBM50256509
Synonyms:CHEMBL449527 | N-1,3,4-thiadiazol-2-ylsulfamide
TypeSmall organic molecule
Emp. Form.C2H4N4O2S2
Mol. Mass.180.209
SMILESNS(=O)(=O)Nc1nncs1