Reaction Details
TargetCarbonic anhydrase 4
LigandBDBM10888
Substrate/Competitorn/a
Meas. Tech.ChEMBL_519585 (CHEMBL943660)
Ki 8590±n/a nM
Citation Smaine, FZPacchiano, FRami, MBarragan-Montero, VVullo, DScozzafava, AWinum, JYSupuran, CT Carbonic anhydrase inhibitors: 2-substituted-1,3,4-thiadiazole-5-sulfamides act as powerful and selective inhibitors of the mitochondrial isozymes VA and VB over the cytosolic and membrane-associated carbonic anhydrases I, II and IV. Bioorg Med Chem Lett18:6332-5 (2008) 
 
Carbonic anhydrase 4
Name:Carbonic anhydrase 4
Type:Enzyme
Mol. Mass.:35037.98
Organism:Homo sapiens (Human)
Description:P22748
Residue:312
BDBM10888
NameBDBM10888
Synonyms:1,2-benzoxazol-3-ylmethanesulfonamide SPR_2 Zonisamide Zonisamide (ZNS) Zonisamide, ZNS
TypeSmall organic molecule
Emp. Form.C8H8N2O3S
Mol. Mass.212.226
SMILESNS(=O)(=O)Cc1noc2ccccc12