Reaction Details
TargetCarbonic anhydrase 5A, mitochondrial
LigandBDBM50256513
Substrate/Competitorn/a
Meas. Tech.ChEMBL_519586 (CHEMBL943661)
Ki 32000±n/a nM
Citation Smaine, FZPacchiano, FRami, MBarragan-Montero, VVullo, DScozzafava, AWinum, JYSupuran, CT Carbonic anhydrase inhibitors: 2-substituted-1,3,4-thiadiazole-5-sulfamides act as powerful and selective inhibitors of the mitochondrial isozymes VA and VB over the cytosolic and membrane-associated carbonic anhydrases I, II and IV. Bioorg Med Chem Lett18:6332-5 (2008) 
 
Carbonic anhydrase 5A, mitochondrial
Name:Carbonic anhydrase 5A, mitochondrial
Type:Enzyme
Mol. Mass.:34755.54
Organism:Homo sapiens (Human)
Description:Human (cloned) isozyme
Residue:305
BDBM50256513
NameBDBM50256513
Synonyms:CHEMBL459356 | N-[5-(methylthio)-1,3,4-thiadiazol-2-yl]sulfamide
TypeSmall organic molecule
Emp. Form.C3H6N4O2S3
Mol. Mass.226.3
SMILESCSc1nnc(NS(N)(=O)=O)s1