Reaction Details
TargetMitogen-activated protein kinase 14
LigandBDBM50264991
Substrate/Competitorn/a
Meas. Tech.ChEMBL_497084 (CHEMBL997720)
Ki 98±n/a nM
Citation Baldwin, IBamborough, PHaslam, CGHunjan, SSLongstaff, TMooney, CJPatel, SQuinn, JSomers, DO Kinase array design, back to front: biaryl amides. Bioorg Med Chem Lett18:5285-9 (2008) 
 
Mitogen-activated protein kinase 14
Name:Mitogen-activated protein kinase 14
Type:Serine/threonine-protein kinase
Mol. Mass.:41286.76
Organism:Homo sapiens (Human)
Description:Q16539
Residue:360
BDBM50264991
NameBDBM50264991
Synonyms:CHEMBL496130 | N-cyclopropyl-6-methyl-4'-(5-methyl-1,2,4-oxadiazol-3-yl)biphenyl-3-carboxamide
TypeSmall organic molecule
Emp. Form.C20H19N3O2
Mol. Mass.333.3838
SMILESCc1nc(no1)-c1ccc(cc1)-c1cc(ccc1C)C(=O)NC1CC1