Reaction Details
TargetMitogen-activated protein kinase 14
LigandBDBM50265110
Substrate/Competitorn/a
Meas. Tech.ChEMBL_497084 (CHEMBL997720)
Ki 18±n/a nM
Citation Baldwin, IBamborough, PHaslam, CGHunjan, SSLongstaff, TMooney, CJPatel, SQuinn, JSomers, DO Kinase array design, back to front: biaryl amides. Bioorg Med Chem Lett18:5285-9 (2008) 
 
Mitogen-activated protein kinase 14
Name:Mitogen-activated protein kinase 14
Type:Serine/threonine-protein kinase
Mol. Mass.:41286.76
Organism:Homo sapiens (Human)
Description:Q16539
Residue:360
BDBM50265110
NameBDBM50265110
Synonyms:3-(3-butyl-2,4-dioxo-1,2,3,4-tetrahydroquinazolin-7-yl)-N-cyclopropyl-4-methylbenzamide | CHEMBL497976
TypeSmall organic molecule
Emp. Form.C23H25N3O3
Mol. Mass.391.4629
SMILESCCCCn1c(=O)[nH]c2cc(ccc2c1=O)-c1cc(ccc1C)C(=O)NC1CC1