Reaction Details
TargetMitogen-activated protein kinase 14
LigandBDBM50265195
Substrate/Competitorn/a
Meas. Tech.ChEMBL_497084 (CHEMBL997720)
Ki 49±n/a nM
Citation Baldwin, IBamborough, PHaslam, CGHunjan, SSLongstaff, TMooney, CJPatel, SQuinn, JSomers, DO Kinase array design, back to front: biaryl amides. Bioorg Med Chem Lett18:5285-9 (2008) 
 
Mitogen-activated protein kinase 14
Name:Mitogen-activated protein kinase 14
Type:Serine/threonine-protein kinase
Mol. Mass.:41286.76
Organism:Homo sapiens (Human)
Description:Q16539
Residue:360
BDBM50265195
NameBDBM50265195
Synonyms:CHEMBL495917 | N-(4-methyl-3-(2-oxo-1,2-dihydroquinolin-6-yl)phenyl)-2-(pyrrolidin-1-yl)isonicotinamide
TypeSmall organic molecule
Emp. Form.C26H24N4O2
Mol. Mass.424.4944
SMILESCc1ccc(NC(=O)c2ccnc(c2)N2CCCC2)cc1-c1ccc2[nH]c(=O)ccc2c1