Reaction Details
TargetMitogen-activated protein kinase 14
LigandBDBM50265198
Substrate/Competitorn/a
Meas. Tech.ChEMBL_497084 (CHEMBL997720)
Ki 18±n/a nM
Citation Baldwin, IBamborough, PHaslam, CGHunjan, SSLongstaff, TMooney, CJPatel, SQuinn, JSomers, DO Kinase array design, back to front: biaryl amides. Bioorg Med Chem Lett18:5285-9 (2008) 
 
Mitogen-activated protein kinase 14
Name:Mitogen-activated protein kinase 14
Type:Serine/threonine-protein kinase
Mol. Mass.:41286.76
Organism:Homo sapiens (Human)
Description:Q16539
Residue:360
BDBM50265198
NameBDBM50265198
Synonyms:4-methyl-N-(3-morpholinophenyl)-3-(1-oxo-1,2-dihydroisoquinolin-7-yl)benzamide | CHEMBL498183
TypeSmall organic molecule
Emp. Form.C27H25N3O3
Mol. Mass.439.5057
SMILESCc1ccc(cc1-c1ccc2cc[nH]c(=O)c2c1)C(=O)Nc1cccc(c1)N1CCOCC1