Reaction Details
TargetMitogen-activated protein kinase 14
LigandBDBM50265260
Substrate/Competitorn/a
Meas. Tech.ChEMBL_497084 (CHEMBL997720)
Ki 4.5±n/a nM
Citation Baldwin, IBamborough, PHaslam, CGHunjan, SSLongstaff, TMooney, CJPatel, SQuinn, JSomers, DO Kinase array design, back to front: biaryl amides. Bioorg Med Chem Lett18:5285-9 (2008) 
 
Mitogen-activated protein kinase 14
Name:Mitogen-activated protein kinase 14
Type:Serine/threonine-protein kinase
Mol. Mass.:41286.76
Organism:Homo sapiens (Human)
Description:Q16539
Residue:360
BDBM50265260
NameBDBM50265260
Synonyms:3-(isoquinolin-7-yl)-4-methyl-N-(3-morpholinophenyl)benzamide | CHEMBL497375
TypeSmall organic molecule
Emp. Form.C27H25N3O2
Mol. Mass.423.5063
SMILESCc1ccc(cc1-c1ccc2ccncc2c1)C(=O)Nc1cccc(c1)N1CCOCC1