Reaction Details
TargetMitogen-activated protein kinase 14
LigandBDBM50265368
Substrate/Competitorn/a
Meas. Tech.ChEMBL_497084 (CHEMBL997720)
Ki 19±n/a nM
Citation Baldwin, IBamborough, PHaslam, CGHunjan, SSLongstaff, TMooney, CJPatel, SQuinn, JSomers, DO Kinase array design, back to front: biaryl amides. Bioorg Med Chem Lett18:5285-9 (2008) 
 
Mitogen-activated protein kinase 14
Name:Mitogen-activated protein kinase 14
Type:Serine/threonine-protein kinase
Mol. Mass.:41286.76
Organism:Homo sapiens (Human)
Description:Q16539
Residue:360
BDBM50265368
NameBDBM50265368
Synonyms:3-(3-aminobenzo[d]isoxazol-6-yl)-4-methyl-N-(3-morpholinophenyl)benzamide | CHEMBL526078
TypeSmall organic molecule
Emp. Form.C25H24N4O3
Mol. Mass.428.4831
SMILESCc1ccc(cc1-c1ccc2c(N)noc2c1)C(=O)Nc1cccc(c1)N1CCOCC1