Reaction Details
TargetMacrophage colony-stimulating factor 1 receptor
LigandBDBM50263093
Substrate/Competitorn/a
Meas. Tech.ChEMBL_497087 (CHEMBL998565)
IC50>20000±n/a nM
Citation Baldwin, IBamborough, PHaslam, CGHunjan, SSLongstaff, TMooney, CJPatel, SQuinn, JSomers, DO Kinase array design, back to front: biaryl amides. Bioorg Med Chem Lett18:5285-9 (2008) 
 
Macrophage colony-stimulating factor 1 receptor
Name:Macrophage colony-stimulating factor 1 receptor
Type:Protein
Mol. Mass.:107979.48
Organism:Homo sapiens (Human)
Description:P07333
Residue:972
BDBM50263093
NameBDBM50263093
Synonyms:6-Methyl-biphenyl-3,4'-dicarboxylic acid 3-cyclopropylamide 4'-cyclopropylmethyl-amide N3-cyclopropyl-N4'-(cyclopropylmethyl)-6-methylbiphenyl-3,4'-dicarboxamide | N~3~-cyclopropyl-N~4~'-(cyclopropylmethyl)-6-methylbiphenyl-3,4'-dicarboxamide
TypeSmall organic molecule
Emp. Form.C22H24N2O2
Mol. Mass.348.4382
SMILESCc1ccc(cc1-c1ccc(cc1)C(=O)NCC1CC1)C(=O)NC1CC1