Reaction Details
TargetHistone deacetylase 1
LigandBDBM50275576
Substrate/Competitorn/a
Meas. Tech.ChEMBL_496821 (CHEMBL1008834)
IC50>500±n/a nM
Citation Pescatore, GKinzel, OAttenni, BCecchetti, OFiore, FFonsi, MRowley, MSchultz-Fademrecht, CSerafini, SSteinkühler, CJones, P Optimization of a series of potent and selective ketone histone deacetylase inhibitors. Bioorg Med Chem Lett18:5528-32 (2008) 
 
Histone deacetylase 1
Name:Histone deacetylase 1
Type:Enzyme
Mol. Mass.:55090.27
Organism:Homo sapiens (Human)
Description:Q13547
Residue:482
BDBM50275576
NameBDBM50275576
Synonyms:(S)-1-methyl-N-(7-oxo-1-(5-(pyridin-2-yl)-1H-imidazol-2-yl)octyl)piperidine-4-carboxamide | CHEMBL487777
TypeSmall organic molecule
Emp. Form.C23H33N5O2
Mol. Mass.411.5404
SMILESCN1CCC(CC1)C(=O)N[C@@H](CCCCCC(C)=O)c1nc(c[nH]1)-c1ccccn1