Reaction Details
TargetHistone deacetylase 3
LigandBDBM50275647
Substrate/Competitorn/a
Meas. Tech.ChEMBL_496827 (CHEMBL1008840)
IC50 27±n/a nM
Citation Pescatore, GKinzel, OAttenni, BCecchetti, OFiore, FFonsi, MRowley, MSchultz-Fademrecht, CSerafini, SSteinkühler, CJones, P Optimization of a series of potent and selective ketone histone deacetylase inhibitors. Bioorg Med Chem Lett18:5528-32 (2008) 
 
Histone deacetylase 3
Name:Histone deacetylase 3
Type:Enzyme
Mol. Mass.:48829.55
Organism:Homo sapiens (Human)
Description:O15379
Residue:428
BDBM50275647
NameBDBM50275647
Synonyms:(S)-1-methyl-N-(1-(5-(naphthalen-2-yl)-1H-imidazol-2-yl)-7-oxodecyl)piperidine-4-carboxamide | CHEMBL487143
TypeSmall organic molecule
Emp. Form.C30H40N4O2
Mol. Mass.488.6642
SMILESCCCC(=O)CCCCC[C@H](NC(=O)C1CCN(C)CC1)c1nc(c[nH]1)-c1ccc2ccccc2c1