Reaction Details
TargetHistone deacetylase 1
LigandBDBM50275952
Substrate/Competitorn/a
Meas. Tech.ChEMBL_496821 (CHEMBL1008834)
IC50 110±n/a nM
Citation Pescatore, GKinzel, OAttenni, BCecchetti, OFiore, FFonsi, MRowley, MSchultz-Fademrecht, CSerafini, SSteinkühler, CJones, P Optimization of a series of potent and selective ketone histone deacetylase inhibitors. Bioorg Med Chem Lett18:5528-32 (2008) 
 
Histone deacetylase 1
Name:Histone deacetylase 1
Type:Enzyme
Mol. Mass.:55090.27
Organism:Homo sapiens (Human)
Description:Q13547
Residue:482
BDBM50275952
NameBDBM50275952
Synonyms:(S)-3-cyano-N-(7-oxo-1-(5-phenyl-1H-imidazol-2-yl)octyl)benzenesulfonamide | CHEMBL472233
TypeSmall organic molecule
Emp. Form.C24H26N4O3S
Mol. Mass.450.553
SMILESCC(=O)CCCCC[C@H](NS(=O)(=O)c1cccc(c1)C#N)c1nc(c[nH]1)-c1ccccc1