Reaction Details
TargetHistone deacetylase 1
LigandBDBM50275996
Substrate/Competitorn/a
Meas. Tech.ChEMBL_496821 (CHEMBL1008834)
IC50 250±n/a nM
Citation Pescatore, GKinzel, OAttenni, BCecchetti, OFiore, FFonsi, MRowley, MSchultz-Fademrecht, CSerafini, SSteinkühler, CJones, P Optimization of a series of potent and selective ketone histone deacetylase inhibitors. Bioorg Med Chem Lett18:5528-32 (2008) 
 
Histone deacetylase 1
Name:Histone deacetylase 1
Type:Enzyme
Mol. Mass.:55090.27
Organism:Homo sapiens (Human)
Description:Q13547
Residue:482
BDBM50275996
NameBDBM50275996
Synonyms:(S)-4-methoxy-N-(7-oxo-1-(5-phenyl-1H-imidazol-2-yl)octyl)benzenesulfonamide | CHEMBL469513
TypeSmall organic molecule
Emp. Form.C24H29N3O4S
Mol. Mass.455.57
SMILESCOc1ccc(cc1)S(=O)(=O)N[C@@H](CCCCCC(C)=O)c1nc(c[nH]1)-c1ccccc1