Reaction Details
TargetHistone deacetylase 1
LigandBDBM50275369
Substrate/Competitorn/a
Meas. Tech.ChEMBL_496821 (CHEMBL1008834)
IC50 190±n/a nM
Citation Pescatore, GKinzel, OAttenni, BCecchetti, OFiore, FFonsi, MRowley, MSchultz-Fademrecht, CSerafini, SSteinkühler, CJones, P Optimization of a series of potent and selective ketone histone deacetylase inhibitors. Bioorg Med Chem Lett18:5528-32 (2008) 
 
Histone deacetylase 1
Name:Histone deacetylase 1
Type:Enzyme
Mol. Mass.:55090.27
Organism:Homo sapiens (Human)
Description:Q13547
Residue:482
BDBM50275369
NameBDBM50275369
Synonyms:(S)-N-(7-oxo-1-(5-phenyl-1H-imidazol-2-yl)octyl)-3-(piperidin-1-yl)propanamide | CHEMBL487179
TypeSmall organic molecule
Emp. Form.C25H36N4O2
Mol. Mass.424.5789
SMILESCC(=O)CCCCC[C@H](NC(=O)CCN1CCCCC1)c1nc(c[nH]1)-c1ccccc1