Reaction Details
TargetHistone deacetylase 1
LigandBDBM50275491
Substrate/Competitorn/a
Meas. Tech.ChEMBL_496821 (CHEMBL1008834)
IC50 100±n/a nM
Citation Pescatore, GKinzel, OAttenni, BCecchetti, OFiore, FFonsi, MRowley, MSchultz-Fademrecht, CSerafini, SSteinkühler, CJones, P Optimization of a series of potent and selective ketone histone deacetylase inhibitors. Bioorg Med Chem Lett18:5528-32 (2008) 
 
Histone deacetylase 1
Name:Histone deacetylase 1
Type:Enzyme
Mol. Mass.:55090.27
Organism:Homo sapiens (Human)
Description:Q13547
Residue:482
BDBM50275491
NameBDBM50275491
Synonyms:(S)-N-(1-(5-(4-bromophenyl)-1H-imidazol-2-yl)-7-oxooctyl)-1-methylpiperidine-4-carboxamide | CHEMBL485723
TypeSmall organic molecule
Emp. Form.C24H33BrN4O2
Mol. Mass.489.448
SMILESCN1CCC(CC1)C(=O)N[C@@H](CCCCCC(C)=O)c1nc(c[nH]1)-c1ccc(Br)cc1