Reaction Details
TargetHistamine H2 receptor
LigandBDBM50275884
Substrate/Competitorn/a
Meas. Tech.ChEMBL_493062 (CHEMBL953176)
EC50 78±n/a nM
Citation Ghorai, PKraus, AKeller, MGötte, CIgel, PSchneider, ESchnell, DBernhardt, GDove, SZabel, MElz, SSeifert, RBuschauer, A Acylguanidines as bioisosteres of guanidines: NG-acylated imidazolylpropylguanidines, a new class of histamine H2 receptor agonists. J Med Chem51:7193-204 (2009) 
 
Histamine H2 receptor
Name:Histamine H2 receptor
Type:G Protein-Coupled Receptor (GPCR)
Mol. Mass.:40115.31
Organism:Homo sapiens (Human)
Description:n/a
Residue:359
BDBM50275884
NameBDBM50275884
Synonyms:CHEMBL471413 | N1-(3,3-Diphenylpropanoyl)-N2-[3-(1H-imidazol-4-yl)propyl]guanidine
TypeSmall organic molecule
Emp. Form.C22H25N5O
Mol. Mass.375.4668
SMILESNC(NC(=O)CC(c1ccccc1)c1ccccc1)=NCCCc1cnc[nH]1