Reaction Details
TargetHistamine H2 receptor
LigandBDBM50276073
Substrate/Competitorn/a
Meas. Tech.ChEMBL_493062 (CHEMBL953176)
EC50 109±n/a nM
Citation Ghorai, PKraus, AKeller, MGötte, CIgel, PSchneider, ESchnell, DBernhardt, GDove, SZabel, MElz, SSeifert, RBuschauer, A Acylguanidines as bioisosteres of guanidines: NG-acylated imidazolylpropylguanidines, a new class of histamine H2 receptor agonists. J Med Chem51:7193-204 (2009) 
 
Histamine H2 receptor
Name:Histamine H2 receptor
Type:G Protein-Coupled Receptor (GPCR)
Mol. Mass.:40115.31
Organism:Homo sapiens (Human)
Description:n/a
Residue:359
BDBM50276073
NameBDBM50276073
Synonyms:CHEMBL502339 | N1-[3-(1H-Imidazol-4-yl)propyl]-N2-[3-(thiophen-2-yl)butanoyl] guanidine
TypeSmall organic molecule
Emp. Form.C15H21N5OS
Mol. Mass.319.425
SMILESCC(CC(=O)NC(N)=NCCCc1cnc[nH]1)c1cccs1