Reaction Details
TargetHistamine H1 receptor
LigandBDBM86744
Substrate/Competitorn/a
Meas. Tech.ChEMBL_493057 (CHEMBL953171)
Kd 2454.71±n/a nM
Citation Ghorai, PKraus, AKeller, MGötte, CIgel, PSchneider, ESchnell, DBernhardt, GDove, SZabel, MElz, SSeifert, RBuschauer, A Acylguanidines as bioisosteres of guanidines: NG-acylated imidazolylpropylguanidines, a new class of histamine H2 receptor agonists. J Med Chem51:7193-204 (2009) 
 
Histamine H1 receptor
Name:Histamine H1 receptor
Type:G Protein-Coupled Receptor (GPCR)
Mol. Mass.:55641.53
Organism:Cavia porcellus (domestic guinea pig)
Description:Guinea pig cerebellum was used in binding assay.
Residue:488
BDBM86744
NameBDBM86744
Synonyms:UR-AK62
TypeSmall organic molecule
Emp. Form.C15H25N5O
Mol. Mass.291.3919
SMILESNC(NC(=O)CC1CCCCC1)=NCCCc1cnc[nH]1