Reaction Details
TargetHistamine H2 receptor
LigandBDBM86739
Substrate/Competitorn/a
Meas. Tech.ChEMBL_493052 (CHEMBL953166)
EC50 1174.9±n/a nM
Citation Ghorai, PKraus, AKeller, MGötte, CIgel, PSchneider, ESchnell, DBernhardt, GDove, SZabel, MElz, SSeifert, RBuschauer, A Acylguanidines as bioisosteres of guanidines: NG-acylated imidazolylpropylguanidines, a new class of histamine H2 receptor agonists. J Med Chem51:7193-204 (2009) 
 
Histamine H2 receptor
Name:Histamine H2 receptor
Type:G Protein-Coupled Receptor (GPCR)
Mol. Mass.:40567.22
Organism:Cavia porcellus (domestic guinea pig)
Description:For the H2 receptor-binding assays, guinea pig striatum was used.
Residue:359
BDBM86739
NameBDBM86739
Synonyms:UR-AK41
TypeSmall organic molecule
Emp. Form.C14H17N5O
Mol. Mass.271.3177
SMILESNC(NC(=O)c1ccccc1)=NCCCc1cnc[nH]1