Reaction Details
TargetHistamine H1 receptor
LigandBDBM86745
Substrate/Competitorn/a
Meas. Tech.ChEMBL_493057 (CHEMBL953171)
Kd 2137.96±n/a nM
Citation Ghorai, PKraus, AKeller, MGötte, CIgel, PSchneider, ESchnell, DBernhardt, GDove, SZabel, MElz, SSeifert, RBuschauer, A Acylguanidines as bioisosteres of guanidines: NG-acylated imidazolylpropylguanidines, a new class of histamine H2 receptor agonists. J Med Chem51:7193-204 (2009) 
 
Histamine H1 receptor
Name:Histamine H1 receptor
Type:G Protein-Coupled Receptor (GPCR)
Mol. Mass.:55641.53
Organism:Cavia porcellus (domestic guinea pig)
Description:Guinea pig cerebellum was used in binding assay.
Residue:488
BDBM86745
NameBDBM86745
Synonyms:UR-AK51
TypeSmall organic molecule
Emp. Form.C16H21N5O
Mol. Mass.299.3708
SMILESNC(NC(=O)CCc1ccccc1)=NCCCc1cnc[nH]1