Reaction Details
TargetCholinesterase
LigandBDBM31904
Substrate/Competitorn/a
Meas. Tech.ChEMBL_493235 (CHEMBL948465)
IC50 13200±n/a nM
Citation Tumiatti, VMilelli, AMinarini, ARosini, MBolognesi, MLMicco, MAndrisano, VBartolini, MMancini, FRecanatini, MCavalli, AMelchiorre, C Structure-activity relationships of acetylcholinesterase noncovalent inhibitors based on a polyamine backbone. 4. Further investigation on the inner spacer. J Med Chem51:7308-12 (2009) 
 
Cholinesterase
Name:Cholinesterase
Type:Homotetramer
Mol. Mass.:68422.27
Organism:Homo sapiens (Human)
Description:P06276
Residue:602
BDBM31904
NameBDBM31904
Synonyms:CHEMBL345124 Propidium Iodide, 2 | propidium iodide
TypeSmall organic molecule
Emp. Form.C27H34N4
Mol. Mass.414.5846
SMILESCC[N+](C)(CC)CCCn1c(-c2ccccc2)c2cc(N)ccc2c2ccc(=[NH2+])cc12