Reaction Details
TargetDipeptidyl peptidase 4
LigandBDBM50166319
Substrate/Competitorn/a
Meas. Tech.ChEMBL_541721 (CHEMBL1022259)
IC50 0.13±n/a nM
Citation Havale, SHPal, M Medicinal chemistry approaches to the inhibition of dipeptidyl peptidase-4 for the treatment of type 2 diabetes. Bioorg Med Chem17:1783-802 (2009) 
 
Dipeptidyl peptidase 4
Name:Dipeptidyl peptidase 4
Type:Enzyme
Mol. Mass.:88271.01
Organism:Homo sapiens (Human)
Description:P27487
Residue:766
BDBM50166319
NameBDBM50166319
Synonyms:4-[(3S,5S)-5-((S)-2-Cyano-pyrrolidine-1-carbonyl)-pyrrolidin-3-ylamino]-phthalonitrile | CHEMBL370046
TypeSmall organic molecule
Emp. Form.C18H18N6O
Mol. Mass.334.3751
SMILESO=C([C@@H]1C[C@@H](CN1)Nc1ccc(C#N)c(c1)C#N)N1CCC[C@H]1C#N