Reaction Details
TargetHistamine H3 receptor
LigandBDBM50247053
Substrate/Competitorn/a
Meas. Tech.ChEMBL_563456 (CHEMBL961004)
Ki 17±n/a nM
Citation Lazewska, DKuder, KLigneau, XCamelin, JCSchunack, WStark, HKiec-Kononowicz, K Diether derivatives of homo- or substituted piperidines as non-imidazole histamine H3 receptor ligands. Bioorg Med Chem17:3037-42 (2009) 
 
Histamine H3 receptor
Name:Histamine H3 receptor
Type:G Protein-Coupled Receptor (GPCR)
Mol. Mass.:48607.98
Organism:Rattus norvegicus (rat)
Description:n/a
Residue:445
BDBM50247053
NameBDBM50247053
Synonyms:1-(3-(3-(4-chlorophenyl)propoxy)propyl)piperidine Tiprolisant
TypeSmall organic molecule
Emp. Form.C17H26ClNO
Mol. Mass.295.847
SMILESClc1ccc(CCCOCCCN2CCCCC2)cc1