Reaction Details
TargetD(3) dopamine receptor
LigandBDBM50378016
Substrate/Competitorn/a
Meas. Tech.ChEMBL_563523 (CHEMBL961810)
Ki 2.61±n/a nM
Citation Newman, AHGrundt, PCyriac, GDeschamps, JRTaylor, MKumar, RHo, DLuedtke, RR N-(4-(4-(2,3-dichloro- or 2-methoxyphenyl)piperazin-1-yl)butyl)heterobiarylcarboxamides with functionalized linking chains as high affinity and enantioselective D3 receptor antagonists. J Med Chem52:2559-70 (2009) 
 
D(3) dopamine receptor
Name:D(3) dopamine receptor
Type:n/a
Mol. Mass.:44243.43
Organism:Homo sapiens (Human)
Description:n/a
Residue:400
BDBM50378016
NameBDBM50378016
Synonyms:CHEMBL1627304
TypeSmall organic molecule
Emp. Form.C24H27N3O2S
Mol. Mass.421.555
SMILESCOc1ccccc1N1CCN(C\C=C\CNC(=O)c2cc3ccccc3s2)CC1