Reaction Details
TargetD(1A) dopamine receptor
LigandBDBM50119390
Substrate/Competitorn/a
Meas. Tech.ChEMBL_563537 (CHEMBL961824)
Ki 1195±n/a nM
Citation Newman, AHGrundt, PCyriac, GDeschamps, JRTaylor, MKumar, RHo, DLuedtke, RR N-(4-(4-(2,3-dichloro- or 2-methoxyphenyl)piperazin-1-yl)butyl)heterobiarylcarboxamides with functionalized linking chains as high affinity and enantioselective D3 receptor antagonists. J Med Chem52:2559-70 (2009) 
 
D(1A) dopamine receptor
Name:D(1A) dopamine receptor
Type:Enzyme
Mol. Mass.:49303.43
Organism:Homo sapiens (Human)
Description:P21728
Residue:446
BDBM50119390
NameBDBM50119390
Synonyms:Benzo[b]thiophene-2-carboxylic acid {4-[4-(2,3-dichloro-phenyl)-piperazin-1-yl]-butyl}-amide N-(4-(4-(2,3-dichlorophenyl)piperazin-1-yl)butyl)benzo[b]thiophene-2-carboxamide
TypeSmall organic molecule
Emp. Form.C23H25Cl2N3OS
Mol. Mass.462.435
SMILESClc1cccc(N2CCN(CCCCNC(=O)c3cc4ccccc4s3)CC2)c1Cl