Reaction Details
TargetATP-dependent translocase ABCB1
LigandBDBM517
Substrate/Competitorn/a
Meas. Tech.ChEMBL_564893 (CHEMBL955890)
IC50>100000±n/a nM
Citation Tong, LPhan, TKRobinson, KLBabusis, DStrab, RBhoopathy, SHidalgo, IJRhodes, GRRay, AS Effects of human immunodeficiency virus protease inhibitors on the intestinal absorption of tenofovir disoproxil fumarate in vitro. Antimicrob Agents Chemother51:3498-504 (2007) 
 
ATP-dependent translocase ABCB1
Name:ATP-dependent translocase ABCB1
Type:Protein
Mol. Mass.:141503.50
Organism:Homo sapiens (Human)
Description:P08183
Residue:1280
BDBM517
NameBDBM517
Synonyms:(2S)-1-[(2S,4R)-4-benzyl-2-hydroxy-4-{[(1S,2R)-2-hydroxy-2,3-dihydro-1H-inden-1-yl]carbamoyl}butyl]-N-tert-butyl-4-(pyridin-3-ylmethyl)piperazine-2-carboxamide Crixivan Indinavir L-735, 524 | MK639
TypeSmall organic molecule
Emp. Form.C36H47N5O4
Mol. Mass.613.7895
SMILESCC(C)(C)NC(=O)[C@@H]1CN(Cc2cccnc2)CCN1C[C@@H](O)C[C@@H](Cc1ccccc1)C(=O)N[C@@H]1[C@H](O)Cc2ccccc12