Reaction Details
TargetDelta-type opioid receptor
LigandBDBM50266961
Substrate/Competitorn/a
Meas. Tech.ChEMBL_563707 (CHEMBL992671)
Ki>1000±n/a nM
Citation Yang, LXu, WChen, FLiu-Chen, LYMa, ZLee, DY Synthesis and biological evaluation of C-12 triazole and oxadiazole analogs of salvinorin A. Bioorg Med Chem Lett19:1301-4 (2009) 
 
Delta-type opioid receptor
Name:Delta-type opioid receptor
Type:Enzyme Catalytic Domain
Mol. Mass.:40577.25
Organism:MOUSE
Description:P32300
Residue:372
BDBM50266961
NameBDBM50266961
Synonyms:(2S,4aR,6aR,7R,9S,10aS,10bR)-methyl 9-acetoxy-2-(1-benzyl-1H-1,2,3-triazol-4-yl)-6a,10b-dimethyl-4,10-dioxododecahydro-1H-benzo[f]isochromene-7-carboxylate | CHEMBL474275
TypeSmall organic molecule
Emp. Form.C28H33N3O7
Mol. Mass.523.5775
SMILESCOC(=O)[C@@H]1C[C@H](OC(C)=O)C(=O)[C@H]2[C@@]1(C)CC[C@H]1C(=O)O[C@@H](C[C@]21C)c1cn(Cc2ccccc2)nn1