Reaction Details
TargetKappa-type opioid receptor
LigandBDBM50278385
Substrate/Competitorn/a
Meas. Tech.ChEMBL_564844 (CHEMBL955071)
Ki 0.240000±n/a nM
Citation Wentland, MPLou, RLu, QBu, YDenhardt, CJin, JGanorkar, RVanAlstine, MAGuo, CCohen, DJBidlack, JM Syntheses of novel high affinity ligands for opioid receptors. Bioorg Med Chem Lett19:2289-94 (2009) 
 
Kappa-type opioid receptor
Name:Kappa-type opioid receptor
Type:G Protein-Coupled Receptor (GPCR)
Mol. Mass.:42648.76
Organism:Homo sapiens (Human)
Description:P41145
Residue:380
BDBM50278385
NameBDBM50278385
Synonyms:6-desoxonaltrexone | CHEMBL511816
TypeSmall organic molecule
Emp. Form.C20H25NO3
Mol. Mass.327.4174
SMILESOc1ccc2C[C@H]3N(CC4CC4)CC[C@]45[C@H](CCC[C@@]34O)Oc1c25