Reaction Details
TargetMu-type opioid receptor
LigandBDBM50241341
Substrate/Competitorn/a
Meas. Tech.ChEMBL_565185 (CHEMBL958391)
EC50 2.6±n/a nM
Citation Wentland, MPLou, RLu, QBu, YDenhardt, CJin, JGanorkar, RVanAlstine, MAGuo, CCohen, DJBidlack, JM Syntheses of novel high affinity ligands for opioid receptors. Bioorg Med Chem Lett19:2289-94 (2009) 
 
Mu-type opioid receptor
Name:Mu-type opioid receptor
Type:G Protein-Coupled Receptor (GPCR)
Mol. Mass.:44789.51
Organism:Homo sapiens (Human)
Description:P35372
Residue:400
BDBM50241341
NameBDBM50241341
Synonyms:(-)-(5R)-4,5-Epoxy-3-hydroxy-9alpha-methylmorphinan-6-one 4,5-Epoxy-3-hydroxy-17-methylmorphinan-6-one 6-Deoxy-7,8-dihydro-6-oxomorphine CHEMBL398707 Dihydromorphinone HYDROMORPHONE Hydromorphone Hydrochloride | Idromorfone
TypeSmall organic molecule
Emp. Form.C17H19NO3
Mol. Mass.285.3377
SMILESCN1CC[C@@]23[C@H]4Oc5c2c(C[C@@H]1[C@@H]3CCC4=O)ccc5O