Reaction Details
TargetMu-type opioid receptor
LigandBDBM50128411
Substrate/Competitorn/a
Meas. Tech.ChEMBL_565185 (CHEMBL958391)
EC50 4.9±n/a nM
Citation Wentland, MPLou, RLu, QBu, YDenhardt, CJin, JGanorkar, RVanAlstine, MAGuo, CCohen, DJBidlack, JM Syntheses of novel high affinity ligands for opioid receptors. Bioorg Med Chem Lett19:2289-94 (2009) 
 
Mu-type opioid receptor
Name:Mu-type opioid receptor
Type:G Protein-Coupled Receptor (GPCR)
Mol. Mass.:44789.51
Organism:Homo sapiens (Human)
Description:P35372
Residue:400
BDBM50128411
NameBDBM50128411
Synonyms:3-desoxy-3-carboxamidonaltrexone CHEMBL56695
TypeSmall organic molecule
Emp. Form.C21H24N2O4
Mol. Mass.368.4263
SMILESNC(=O)c1ccc2C[C@H]3N(CC4CC4)CC[C@@]45[C@@H](Oc1c24)C(=O)CC[C@@]35O