Reaction Details
TargetKappa-type opioid receptor
LigandBDBM50278336
Substrate/Competitorn/a
Meas. Tech.ChEMBL_564844 (CHEMBL955071)
Ki 210±n/a nM
Citation Wentland, MPLou, RLu, QBu, YDenhardt, CJin, JGanorkar, RVanAlstine, MAGuo, CCohen, DJBidlack, JM Syntheses of novel high affinity ligands for opioid receptors. Bioorg Med Chem Lett19:2289-94 (2009) 
 
Kappa-type opioid receptor
Name:Kappa-type opioid receptor
Type:G Protein-Coupled Receptor (GPCR)
Mol. Mass.:42648.76
Organism:Homo sapiens (Human)
Description:P41145
Residue:380
BDBM50278336
NameBDBM50278336
Synonyms:(1S,5R,13R,17S)-10-carbamoyl-4-(cyclopropylmethyl)-17-hydroxy-4-methyl-14-oxo-12-oxa-4-azapentacyclo[9.6.1.0^{1,13}.0^{5,17}.0^{7,18}]octadeca-7(18),8,10-trien-4-ium iodide | CHEMBL511461
TypeSmall organic molecule
Emp. Form.C22H27N2O4
Mol. Mass.383.4602
SMILESC[N+]1(CC2CC2)CC[C@@]23[C@H]4Oc5c2c(C[C@@H]1[C@]3(O)CCC4=O)ccc5C(N)=O