Reaction Details
TargetSialidase
LigandBDBM50278443
Substrate/Competitorn/a
Meas. Tech.ChEMBL_565688 (CHEMBL960046)
Ki 58±n/a nM
Citation Ryu, YBCurtis-Long, MJLee, JWKim, JHKim, JYKang, KYLee, WSPark, KH Characteristic of neuraminidase inhibitory xanthones from Cudrania tricuspidata. Bioorg Med Chem17:2744-50 (2009) 
 
Sialidase
Name:Sialidase
Type:PROTEIN
Mol. Mass.:42808.79
Organism:Clostridium perfringens
Description:ChEMBL_991336
Residue:382
BDBM50278443
NameBDBM50278443
Synonyms:1,3,6,7-tetrahydroxy-2-(3-methylbut-2-enyl)-8-(2-methylbut-3-en-2-yl)-9H-xanthen-9-one | CHEMBL471646
TypeSmall organic molecule
Emp. Form.C23H26O6
Mol. Mass.398.4489
SMILES[#6]\[#6](-[#6])=[#6]/[#6]-c1c(-[#8])c(-[#8])cc2-[#8]-[#6]-3-[#6]-[#6](=O)-[#6](-[#6](=O)-[#6]-3-[#6](=O)-c12)C([#6])([#6])[#6]=[#6]